{"text_format":"1","workbook":"xlsx","n_sheets":5,"sheets":["№5","Остатки на утро","В пути","Запланированные отгрузки","data"],"not_rendered":{"charts":0,"images":0,"macros":1,"external_links":1,"defined_names":1,"comments":0,"pivot_tables":0},"unopened":[],"bounds":{"document_bytes":16777216,"sheet_cells":100000,"rows_first":2000,"rows_last":500,"rows_between":2000,"halvings":0,"cell_chars":16384,"cell_head_chars":4096},"cells_cut":0,"cells_raw":0,"read":"whole","date_system":"1900"}

{"sheet":"№5","index":0,"n_rows":274,"n_cols":9,"rows_kept":274,"cut":false,"hidden":false,"merged":[[5,8,9,11]]}
["Склад   :  ","Склад 1"]
[]
["SKU","Остатки на утро, уп",null,"В пути, уп","Запланированные приходы РБ+импорт, уп"]
["Продукт1",{"$f":"INDEX('Остатки на утро'!B:D,MATCH(A4,'Остатки на утро'!A:A,0),MATCH($B$1,'Остатки на утро'!$B$1:$D$1,0))","v":80},null,{"$f":"INDEX('В пути'!B:D,MATCH(A4,'В пути'!A:A,0),MATCH($B$1,'В пути'!$B$2:$D$2,0))","v":0}]
["Продукт2",{"$f":"INDEX('Остатки на утро'!B:D,MATCH(A5,'Остатки на утро'!A:A,0),MATCH($B$1,'Остатки на утро'!$B$1:$D$1,0))","v":45},null,{"$f":"INDEX('В пути'!B:D,MATCH(A5,'В пути'!A:A,0),MATCH($B$1,'В пути'!$B$2:$D$2,0))","v":0}]
["Продукт3",{"$f":"INDEX('Остатки на утро'!B:D,MATCH(A6,'Остатки на утро'!A:A,0),MATCH($B$1,'Остатки на утро'!$B$1:$D$1,0))","v":221},null,{"$f":"INDEX('В пути'!B:D,MATCH(A6,'В пути'!A:A,0),MATCH($B$1,'В пути'!$B$2:$D$2,0))","v":0},null,null,null,null,"Заполнте таблицу слева.С помощью формул Excel \nНеобходимые для заполнения  таблицы данные\nнаходятся  на листах \"остатки на утро\", \"в пути\", \n\"запланированые отгрузки\""]
["Продукт4",{"$f":"INDEX('Остатки на утро'!B:D,MATCH(A7,'Остатки на утро'!A:A,0),MATCH($B$1,'Остатки на утро'!$B$1:$D$1,0))","v":191.99999999999997},null,{"$f":"INDEX('В пути'!B:D,MATCH(A7,'В пути'!A:A,0),MATCH($B$1,'В пути'!$B$2:$D$2,0))","v":0}]
["Продукт5",{"$f":"INDEX('Остатки на утро'!B:D,MATCH(A8,'Остатки на утро'!A:A,0),MATCH($B$1,'Остатки на утро'!$B$1:$D$1,0))","v":0},null,{"$f":"INDEX('В пути'!B:D,MATCH(A8,'В пути'!A:A,0),MATCH($B$1,'В пути'!$B$2:$D$2,0))","v":0}]
["Продукт6",{"$f":"INDEX('Остатки на утро'!B:D,MATCH(A9,'Остатки на утро'!A:A,0),MATCH($B$1,'Остатки на утро'!$B$1:$D$1,0))","v":9},null,{"$f":"INDEX('В пути'!B:D,MATCH(A9,'В пути'!A:A,0),MATCH($B$1,'В пути'!$B$2:$D$2,0))","v":0}]
["Продукт7",{"$f":"INDEX('Остатки на утро'!B:D,MATCH(A10,'Остатки на утро'!A:A,0),MATCH($B$1,'Остатки на утро'!$B$1:$D$1,0))","v":2.9999999999999996},null,{"$f":"INDEX('В пути'!B:D,MATCH(A10,'В пути'!A:A,0),MATCH($B$1,'В пути'!$B$2:$D$2,0))","v":0}]
["Продукт33",{"$f":"INDEX('Остатки на утро'!B:D,MATCH(A11,'Остатки на утро'!A:A,0),MATCH($B$1,'Остатки на утро'!$B$1:$D$1,0))","v":0},null,{"$f":"INDEX('В пути'!B:D,MATCH(A11,'В пути'!A:A,0),MATCH($B$1,'В пути'!$B$2:$D$2,0))","v":0}]
["Продукт34",{"$f":"INDEX('Остатки на утро'!B:D,MATCH(A12,'Остатки на утро'!A:A,0),MATCH($B$1,'Остатки на утро'!$B$1:$D$1,0))","v":0},null,{"$f":"INDEX('В пути'!B:D,MATCH(A12,'В пути'!A:A,0),MATCH($B$1,'В пути'!$B$2:$D$2,0))","v":0}]
["Продукт35",{"$f":"INDEX('Остатки на утро'!B:D,MATCH(A13,'Остатки на утро'!A:A,0),MATCH($B$1,'Остатки на утро'!$B$1:$D$1,0))","v":0},null,{"$f":"INDEX('В пути'!B:D,MATCH(A13,'В пути'!A:A,0),MATCH($B$1,'В пути'!$B$2:$D$2,0))","v":0}]
["Продукт36",{"$f":"INDEX('Остатки на утро'!B:D,MATCH(A14,'Остатки на утро'!A:A,0),MATCH($B$1,'Остатки на утро'!$B$1:$D$1,0))","v":533},null,{"$f":"INDEX('В пути'!B:D,MATCH(A14,'В пути'!A:A,0),MATCH($B$1,'В пути'!$B$2:$D$2,0))","v":0}]
["Продукт37",{"$f":"INDEX('Остатки на утро'!B:D,MATCH(A15,'Остатки на утро'!A:A,0),MATCH($B$1,'Остатки на утро'!$B$1:$D$1,0))","v":665},null,{"$f":"INDEX('В пути'!B:D,MATCH(A15,'В пути'!A:A,0),MATCH($B$1,'В пути'!$B$2:$D$2,0))","v":0}]
["Продукт38",{"$f":"INDEX('Остатки на утро'!B:D,MATCH(A16,'Остатки на утро'!A:A,0),MATCH($B$1,'Остатки на утро'!$B$1:$D$1,0))","v":296},null,{"$f":"INDEX('В пути'!B:D,MATCH(A16,'В пути'!A:A,0),MATCH($B$1,'В пути'!$B$2:$D$2,0))","v":0}]
["Продукт39",{"$f":"INDEX('Остатки на утро'!B:D,MATCH(A17,'Остатки на утро'!A:A,0),MATCH($B$1,'Остатки на утро'!$B$1:$D$1,0))","v":104},null,{"$f":"INDEX('В пути'!B:D,MATCH(A17,'В пути'!A:A,0),MATCH($B$1,'В пути'!$B$2:$D$2,0))","v":0}]
["Продукт40",{"$f":"INDEX('Остатки на утро'!B:D,MATCH(A18,'Остатки на утро'!A:A,0),MATCH($B$1,'Остатки на утро'!$B$1:$D$1,0))","v":258},null,{"$f":"INDEX('В пути'!B:D,MATCH(A18,'В пути'!A:A,0),MATCH($B$1,'В пути'!$B$2:$D$2,0))","v":0}]
["Продукт41",{"$f":"INDEX('Остатки на утро'!B:D,MATCH(A19,'Остатки на утро'!A:A,0),MATCH($B$1,'Остатки на утро'!$B$1:$D$1,0))","v":80},null,{"$f":"INDEX('В пути'!B:D,MATCH(A19,'В пути'!A:A,0),MATCH($B$1,'В пути'!$B$2:$D$2,0))","v":0}]
["Продукт42",{"$f":"INDEX('Остатки на утро'!B:D,MATCH(A20,'Остатки на утро'!A:A,0),MATCH($B$1,'Остатки на утро'!$B$1:$D$1,0))","v":1},null,{"$f":"INDEX('В пути'!B:D,MATCH(A20,'В пути'!A:A,0),MATCH($B$1,'В пути'!$B$2:$D$2,0))","v":0}]
["Продукт43",{"$f":"INDEX('Остатки на утро'!B:D,MATCH(A21,'Остатки на утро'!A:A,0),MATCH($B$1,'Остатки на утро'!$B$1:$D$1,0))","v":686},null,{"$f":"INDEX('В пути'!B:D,MATCH(A21,'В пути'!A:A,0),MATCH($B$1,'В пути'!$B$2:$D$2,0))","v":0}]
["Продукт44",{"$f":"INDEX('Остатки на утро'!B:D,MATCH(A22,'Остатки на утро'!A:A,0),MATCH($B$1,'Остатки на утро'!$B$1:$D$1,0))","v":70},null,{"$f":"INDEX('В пути'!B:D,MATCH(A22,'В пути'!A:A,0),MATCH($B$1,'В пути'!$B$2:$D$2,0))","v":0}]
["Продукт45",{"$f":"INDEX('Остатки на утро'!B:D,MATCH(A23,'Остатки на утро'!A:A,0),MATCH($B$1,'Остатки на утро'!$B$1:$D$1,0))","v":0},null,{"$f":"INDEX('В пути'!B:D,MATCH(A23,'В пути'!A:A,0),MATCH($B$1,'В пути'!$B$2:$D$2,0))","v":648}]
["Продукт46",{"$f":"INDEX('Остатки на утро'!B:D,MATCH(A24,'Остатки на утро'!A:A,0),MATCH($B$1,'Остатки на утро'!$B$1:$D$1,0))","v":363},null,{"$f":"INDEX('В пути'!B:D,MATCH(A24,'В пути'!A:A,0),MATCH($B$1,'В пути'!$B$2:$D$2,0))","v":280}]
["Продукт47",{"$f":"INDEX('Остатки на утро'!B:D,MATCH(A25,'Остатки на утро'!A:A,0),MATCH($B$1,'Остатки на утро'!$B$1:$D$1,0))","v":33},null,{"$f":"INDEX('В пути'!B:D,MATCH(A25,'В пути'!A:A,0),MATCH($B$1,'В пути'!$B$2:$D$2,0))","v":604.79999999999995}]
["Продукт48",{"$f":"INDEX('Остатки на утро'!B:D,MATCH(A26,'Остатки на утро'!A:A,0),MATCH($B$1,'Остатки на утро'!$B$1:$D$1,0))","v":108.99999999999999},null,{"$f":"INDEX('В пути'!B:D,MATCH(A26,'В пути'!A:A,0),MATCH($B$1,'В пути'!$B$2:$D$2,0))","v":72.959999999999994}]
["Продукт49",{"$f":"INDEX('Остатки на утро'!B:D,MATCH(A27,'Остатки на утро'!A:A,0),MATCH($B$1,'Остатки на утро'!$B$1:$D$1,0))","v":185.00000000000003},null,{"$f":"INDEX('В пути'!B:D,MATCH(A27,'В пути'!A:A,0),MATCH($B$1,'В пути'!$B$2:$D$2,0))","v":0}]
["Продукт50",{"$f":"INDEX('Остатки на утро'!B:D,MATCH(A28,'Остатки на утро'!A:A,0),MATCH($B$1,'Остатки на утро'!$B$1:$D$1,0))","v":98},null,{"$f":"INDEX('В пути'!B:D,MATCH(A28,'В пути'!A:A,0),MATCH($B$1,'В пути'!$B$2:$D$2,0))","v":0}]
["Продукт51",{"$f":"INDEX('Остатки на утро'!B:D,MATCH(A29,'Остатки на утро'!A:A,0),MATCH($B$1,'Остатки на утро'!$B$1:$D$1,0))","v":0},null,{"$f":"INDEX('В пути'!B:D,MATCH(A29,'В пути'!A:A,0),MATCH($B$1,'В пути'!$B$2:$D$2,0))","v":0}]
["Продукт52",{"$f":"INDEX('Остатки на утро'!B:D,MATCH(A30,'Остатки на утро'!A:A,0),MATCH($B$1,'Остатки на утро'!$B$1:$D$1,0))","v":0},null,{"$f":"INDEX('В пути'!B:D,MATCH(A30,'В пути'!A:A,0),MATCH($B$1,'В пути'!$B$2:$D$2,0))","v":0}]
["Продукт53",{"$f":"INDEX('Остатки на утро'!B:D,MATCH(A31,'Остатки на утро'!A:A,0),MATCH($B$1,'Остатки на утро'!$B$1:$D$1,0))","v":0},null,{"$f":"INDEX('В пути'!B:D,MATCH(A31,'В пути'!A:A,0),MATCH($B$1,'В пути'!$B$2:$D$2,0))","v":0}]
["Продукт54",{"$f":"INDEX('Остатки на утро'!B:D,MATCH(A32,'Остатки на утро'!A:A,0),MATCH($B$1,'Остатки на утро'!$B$1:$D$1,0))","v":0},null,{"$f":"INDEX('В пути'!B:D,MATCH(A32,'В пути'!A:A,0),MATCH($B$1,'В пути'!$B$2:$D$2,0))","v":615.6}]
["Продукт55",{"$f":"INDEX('Остатки на утро'!B:D,MATCH(A33,'Остатки на утро'!A:A,0),MATCH($B$1,'Остатки на утро'!$B$1:$D$1,0))","v":0},null,{"$f":"INDEX('В пути'!B:D,MATCH(A33,'В пути'!A:A,0),MATCH($B$1,'В пути'!$B$2:$D$2,0))","v":0}]
["Продукт56",{"$f":"INDEX('Остатки на утро'!B:D,MATCH(A34,'Остатки на утро'!A:A,0),MATCH($B$1,'Остатки на утро'!$B$1:$D$1,0))","v":0},null,{"$f":"INDEX('В пути'!B:D,MATCH(A34,'В пути'!A:A,0),MATCH($B$1,'В пути'!$B$2:$D$2,0))","v":302.39999999999998}]
["Продукт57",{"$f":"INDEX('Остатки на утро'!B:D,MATCH(A35,'Остатки на утро'!A:A,0),MATCH($B$1,'Остатки на утро'!$B$1:$D$1,0))","v":0},null,{"$f":"INDEX('В пути'!B:D,MATCH(A35,'В пути'!A:A,0),MATCH($B$1,'В пути'!$B$2:$D$2,0))","v":72.959999999999994}]
["Продукт58",{"$f":"INDEX('Остатки на утро'!B:D,MATCH(A36,'Остатки на утро'!A:A,0),MATCH($B$1,'Остатки на утро'!$B$1:$D$1,0))","v":0},null,{"$f":"INDEX('В пути'!B:D,MATCH(A36,'В пути'!A:A,0),MATCH($B$1,'В пути'!$B$2:$D$2,0))","v":0}]
["Продукт59",{"$f":"INDEX('Остатки на утро'!B:D,MATCH(A37,'Остатки на утро'!A:A,0),MATCH($B$1,'Остатки на утро'!$B$1:$D$1,0))","v":0},null,{"$f":"INDEX('В пути'!B:D,MATCH(A37,'В пути'!A:A,0),MATCH($B$1,'В пути'!$B$2:$D$2,0))","v":0}]
["Продукт60",{"$f":"INDEX('Остатки на утро'!B:D,MATCH(A38,'Остатки на утро'!A:A,0),MATCH($B$1,'Остатки на утро'!$B$1:$D$1,0))","v":0},null,{"$f":"INDEX('В пути'!B:D,MATCH(A38,'В пути'!A:A,0),MATCH($B$1,'В пути'!$B$2:$D$2,0))","v":0}]
["Продукт61",{"$f":"INDEX('Остатки на утро'!B:D,MATCH(A39,'Остатки на утро'!A:A,0),MATCH($B$1,'Остатки на утро'!$B$1:$D$1,0))","v":0},null,{"$f":"INDEX('В пути'!B:D,MATCH(A39,'В пути'!A:A,0),MATCH($B$1,'В пути'!$B$2:$D$2,0))","v":0}]
["Продукт62",{"$f":"INDEX('Остатки на утро'!B:D,MATCH(A40,'Остатки на утро'!A:A,0),MATCH($B$1,'Остатки на утро'!$B$1:$D$1,0))","v":0},null,{"$f":"INDEX('В пути'!B:D,MATCH(A40,'В пути'!A:A,0),MATCH($B$1,'В пути'!$B$2:$D$2,0))","v":0}]
["Продукт63",{"$f":"INDEX('Остатки на утро'!B:D,MATCH(A41,'Остатки на утро'!A:A,0),MATCH($B$1,'Остатки на утро'!$B$1:$D$1,0))","v":12},null,{"$f":"INDEX('В пути'!B:D,MATCH(A41,'В пути'!A:A,0),MATCH($B$1,'В пути'!$B$2:$D$2,0))","v":0}]
["Продукт64",{"$f":"INDEX('Остатки на утро'!B:D,MATCH(A42,'Остатки на утро'!A:A,0),MATCH($B$1,'Остатки на утро'!$B$1:$D$1,0))","v":0},null,{"$f":"INDEX('В пути'!B:D,MATCH(A42,'В пути'!A:A,0),MATCH($B$1,'В пути'!$B$2:$D$2,0))","v":0}]
["Продукт65",{"$f":"INDEX('Остатки на утро'!B:D,MATCH(A43,'Остатки на утро'!A:A,0),MATCH($B$1,'Остатки на утро'!$B$1:$D$1,0))","v":600},null,{"$f":"INDEX('В пути'!B:D,MATCH(A43,'В пути'!A:A,0),MATCH($B$1,'В пути'!$B$2:$D$2,0))","v":0}]
["Продукт66",{"$f":"INDEX('Остатки на утро'!B:D,MATCH(A44,'Остатки на утро'!A:A,0),MATCH($B$1,'Остатки на утро'!$B$1:$D$1,0))","v":164.00000000000003},null,{"$f":"INDEX('В пути'!B:D,MATCH(A44,'В пути'!A:A,0),MATCH($B$1,'В пути'!$B$2:$D$2,0))","v":0}]
["Продукт67",{"$f":"INDEX('Остатки на утро'!B:D,MATCH(A45,'Остатки на утро'!A:A,0),MATCH($B$1,'Остатки на утро'!$B$1:$D$1,0))","v":0},null,{"$f":"INDEX('В пути'!B:D,MATCH(A45,'В пути'!A:A,0),MATCH($B$1,'В пути'!$B$2:$D$2,0))","v":0}]
["Продукт68",{"$f":"INDEX('Остатки на утро'!B:D,MATCH(A46,'Остатки на утро'!A:A,0),MATCH($B$1,'Остатки на утро'!$B$1:$D$1,0))","v":44},null,{"$f":"INDEX('В пути'!B:D,MATCH(A46,'В пути'!A:A,0),MATCH($B$1,'В пути'!$B$2:$D$2,0))","v":0}]
["Продукт69",{"$f":"INDEX('Остатки на утро'!B:D,MATCH(A47,'Остатки на утро'!A:A,0),MATCH($B$1,'Остатки на утро'!$B$1:$D$1,0))","v":353.00000000000006},null,{"$f":"INDEX('В пути'!B:D,MATCH(A47,'В пути'!A:A,0),MATCH($B$1,'В пути'!$B$2:$D$2,0))","v":0}]
["Продукт70",{"$f":"INDEX('Остатки на утро'!B:D,MATCH(A48,'Остатки на утро'!A:A,0),MATCH($B$1,'Остатки на утро'!$B$1:$D$1,0))","v":127.00000000000001},null,{"$f":"INDEX('В пути'!B:D,MATCH(A48,'В пути'!A:A,0),MATCH($B$1,'В пути'!$B$2:$D$2,0))","v":0}]
["Продукт71",{"$f":"INDEX('Остатки на утро'!B:D,MATCH(A49,'Остатки на утро'!A:A,0),MATCH($B$1,'Остатки на утро'!$B$1:$D$1,0))","v":373.00000000000006},null,{"$f":"INDEX('В пути'!B:D,MATCH(A49,'В пути'!A:A,0),MATCH($B$1,'В пути'!$B$2:$D$2,0))","v":0}]
["Продукт72",{"$f":"INDEX('Остатки на утро'!B:D,MATCH(A50,'Остатки на утро'!A:A,0),MATCH($B$1,'Остатки на утро'!$B$1:$D$1,0))","v":50.999999999999993},null,{"$f":"INDEX('В пути'!B:D,MATCH(A50,'В пути'!A:A,0),MATCH($B$1,'В пути'!$B$2:$D$2,0))","v":0}]
["Продукт73",{"$f":"INDEX('Остатки на утро'!B:D,MATCH(A51,'Остатки на утро'!A:A,0),MATCH($B$1,'Остатки на утро'!$B$1:$D$1,0))","v":0},null,{"$f":"INDEX('В пути'!B:D,MATCH(A51,'В пути'!A:A,0),MATCH($B$1,'В пути'!$B$2:$D$2,0))","v":0}]
["Продукт74",{"$f":"INDEX('Остатки на утро'!B:D,MATCH(A52,'Остатки на утро'!A:A,0),MATCH($B$1,'Остатки на утро'!$B$1:$D$1,0))","v":336},null,{"$f":"INDEX('В пути'!B:D,MATCH(A52,'В пути'!A:A,0),MATCH($B$1,'В пути'!$B$2:$D$2,0))","v":0}]
["Продукт75",{"$f":"INDEX('Остатки на утро'!B:D,MATCH(A53,'Остатки на утро'!A:A,0),MATCH($B$1,'Остатки на утро'!$B$1:$D$1,0))","v":0},null,{"$f":"INDEX('В пути'!B:D,MATCH(A53,'В пути'!A:A,0),MATCH($B$1,'В пути'!$B$2:$D$2,0))","v":0}]
["Продукт76",{"$f":"INDEX('Остатки на утро'!B:D,MATCH(A54,'Остатки на утро'!A:A,0),MATCH($B$1,'Остатки на утро'!$B$1:$D$1,0))","v":0},null,{"$f":"INDEX('В пути'!B:D,MATCH(A54,'В пути'!A:A,0),MATCH($B$1,'В пути'!$B$2:$D$2,0))","v":194.4}]
["Продукт77",{"$f":"INDEX('Остатки на утро'!B:D,MATCH(A55,'Остатки на утро'!A:A,0),MATCH($B$1,'Остатки на утро'!$B$1:$D$1,0))","v":425.99999999999994},null,{"$f":"INDEX('В пути'!B:D,MATCH(A55,'В пути'!A:A,0),MATCH($B$1,'В пути'!$B$2:$D$2,0))","v":241.92}]
["Продукт78",{"$f":"INDEX('Остатки на утро'!B:D,MATCH(A56,'Остатки на утро'!A:A,0),MATCH($B$1,'Остатки на утро'!$B$1:$D$1,0))","v":0},null,{"$f":"INDEX('В пути'!B:D,MATCH(A56,'В пути'!A:A,0),MATCH($B$1,'В пути'!$B$2:$D$2,0))","v":510.72}]
["Продукт79",{"$f":"INDEX('Остатки на утро'!B:D,MATCH(A57,'Остатки на утро'!A:A,0),MATCH($B$1,'Остатки на утро'!$B$1:$D$1,0))","v":0},null,{"$f":"INDEX('В пути'!B:D,MATCH(A57,'В пути'!A:A,0),MATCH($B$1,'В пути'!$B$2:$D$2,0))","v":0}]
["Продукт80",{"$f":"INDEX('Остатки на утро'!B:D,MATCH(A58,'Остатки на утро'!A:A,0),MATCH($B$1,'Остатки на утро'!$B$1:$D$1,0))","v":0},null,{"$f":"INDEX('В пути'!B:D,MATCH(A58,'В пути'!A:A,0),MATCH($B$1,'В пути'!$B$2:$D$2,0))","v":0}]
["Продукт81",{"$f":"INDEX('Остатки на утро'!B:D,MATCH(A59,'Остатки на утро'!A:A,0),MATCH($B$1,'Остатки на утро'!$B$1:$D$1,0))","v":0},null,{"$f":"INDEX('В пути'!B:D,MATCH(A59,'В пути'!A:A,0),MATCH($B$1,'В пути'!$B$2:$D$2,0))","v":0}]
["Продукт82",{"$f":"INDEX('Остатки на утро'!B:D,MATCH(A60,'Остатки на утро'!A:A,0),MATCH($B$1,'Остатки на утро'!$B$1:$D$1,0))","v":0},null,{"$f":"INDEX('В пути'!B:D,MATCH(A60,'В пути'!A:A,0),MATCH($B$1,'В пути'!$B$2:$D$2,0))","v":0}]
{"$rows_left_out":215}
{"sheet":"Остатки на утро","index":1,"n_rows":283,"n_cols":4,"rows_kept":283,"cut":false,"hidden":false,"merged":[]}
["SKU","Склад 1","Склад 2","Склад 3"]
["Продукт1",80,112.58333333333333,120.99999999999999]
["Продукт2",45,63.333333333333329,53.541666666666664]
["Продукт3",221,232.74999999999997,227.99999999999997]
["Продукт4",191.99999999999997,200.54166666666666,139.125]
["Продукт5",0,0,0]
["Продукт6",9,17.5,34]
["Продукт7",2.9999999999999996,32.5,19]
["Продукт8",10,24.5,29]
["Продукт9",17,11.5,30.999999999999996]
["Продукт10",30,20,58]
["Продукт11",0,0,0]
["Продукт12",0,3.4166666666666665,0.95833333333333337]
["Продукт13",41,29.875,0]
["Продукт14",0,0,6]
["Продукт15",194.00000000000003,127,202.95833333333334]
["Продукт16",0,0,0]
["Продукт17",0,0.45,0]
["Продукт18",0,0,0.95]
["Продукт19",1126,780.25,719.6]
["Продукт20",0,0,0]
["Продукт21",207,146,292.60000000000002]
["Продукт22",43.000000000000007,1,1.8]
["Продукт23",56.999999999999993,10.700000000000017,3.1999999999999886]
["Продукт24",227.99999999999997,450.45,217.65]
["Продукт25",0,0,0]
["Продукт26",0,0,0]
["Продукт27",40,93,54]
["Продукт28",0,0,0]
["Продукт29",222.00000000000003,197.00000000000003,254]
["Продукт30",141,151.80000000000001,147]
["Продукт31",0,0,0]
["Продукт32",298,256.10000000000002,202.65000000000003]
["Продукт33",0,0,0]
["Продукт34",0,0,1.7]
["Продукт35",0,0,1]
["Продукт36",533,1201.7,853.85]
["Продукт37",665,278.39999999999998,952.55]
["Продукт38",296,295.55,636.9]
["Продукт39",104,28.25,89.75]
["Продукт40",258,343.05,321.89999999999998]
["Продукт41",80,169.1,152.5]
["Продукт42",1,0,0]
["Продукт43",686,538.45000000000005,855.8]
["Продукт44",70,117,80.099999999999994]
["Продукт45",0,0,0]
["Продукт46",363,363.7,391.85]
["Продукт47",33,121.05,243.6]
["Продукт48",108.99999999999999,124.99999999999999,141.99999999999997]
["Продукт49",185.00000000000003,264.10000000000002,383.35]
["Продукт50",98,172,81.7]
["Продукт51",0,0,0]
["Продукт52",0,0,0]
["Продукт53",0,0,0]
["Продукт54",0,0,0]
["Продукт55",0,0,0]
["Продукт56",0,0,0]
["Продукт57",0,0,0]
["Продукт58",0,0,0]
["Продукт59",0,0,0]
{"$rows_left_out":224}
{"sheet":"В пути","index":2,"n_rows":284,"n_cols":4,"rows_kept":284,"cut":false,"hidden":false,"merged":[]}
["Название строк Монолит"]
[null,"Склад 1","Склад 2","Склад 3"]
["Продукт1",0,0,0]
["Продукт2",0,0,0]
["Продукт3",0,0,0]
["Продукт4",0,0,0]
["Продукт5",0,0,0]
["Продукт6",0,0,0]
["Продукт7",0,0,0]
["Продукт8",0,0,0]
["Продукт9",0,0,0]
["Продукт10",0,0,0]
["Продукт11",0,0,0]
["Продукт12",0,0,0]
["Продукт13",0,0,0]
["Продукт14",0,0,42.24]
["Продукт15",0,0,0]
["Продукт16",0,0,0]
["Продукт17",0,0,9]
["Продукт18",0,0,0]
["Продукт19",0,0,0]
["Продукт20",0,0,0]
["Продукт21",0,0,0]
["Продукт22",0,0,0]
["Продукт23",0,0,0]
["Продукт24",194.4,0,64.8]
["Продукт25",544.32000000000005,0,181.44]
["Продукт26",0,0,0]
["Продукт27",0,0,0]
["Продукт28",0,0,0]
["Продукт29",0,0,0]
["Продукт30",0,0,0]
["Продукт31",0,0,0]
["Продукт32",0,0,0]
["Продукт33",0,0,0]
["Продукт34",0,0,0]
["Продукт35",0,0,0]
["Продукт36",0,0,0]
["Продукт37",0,0,0]
["Продукт38",0,0,0]
["Продукт39",0,0,0]
["Продукт40",0,0,0]
["Продукт41",0,0,0]
["Продукт42",0,0,0]
["Продукт43",0,0,0]
["Продукт44",0,0,0]
["Продукт45",648,0,259.2]
["Продукт46",280,0,0]
["Продукт47",604.79999999999995,0,181.44]
["Продукт48",72.959999999999994,0,1240.32]
["Продукт49",0,0,0]
["Продукт50",0,0,0]
["Продукт51",0,0,0]
["Продукт52",0,0,0]
["Продукт53",0,0,0]
["Продукт54",615.6,0,0]
["Продукт55",0,0,0]
["Продукт56",302.39999999999998,0,0]
["Продукт57",72.959999999999994,0,0]
["Продукт58",0,0,0]
{"$rows_left_out":225}
{"sheet":"Запланированные отгрузки","index":3,"n_rows":300,"n_cols":25,"rows_kept":300,"cut":false,"hidden":false,"merged":[]}
["Остатки","РЦ 1","РЦ 2","РЦ 1","РЦ 1","РЦ 2","РЦ 1","РЦ 1","РЦ 1","РЦ 1","РЦ 1","РЦ 1","РЦ 1","РЦ 1","РЦ 1","РЦ 1","РЦ 1","РЦ 1","РЦ 2","РЦ 1","РЦ 1","РЦ 1","РЦ 1","РЦ 2","РЦ 1"]
["SKU","Склад 3","Склад 1","Склад 2","Склад 2","Склад 2","Склад 3","Склад 3","Склад 3","Склад 1","Склад 1","Склад 1","Склад 2","Склад 2","Склад 3","Склад 3","Склад 3","Склад 3","Склад 3","Склад 3","Склад 3","Склад 1","Склад 1","Склад 1","Склад 1"]
["Продукт1",0,0,0,0,0,0,0,0,0,0,0,0,0,0,0,0,0,0,0,0,0,0,0,0]
["Продукт2",0,45,0,0,90,0,0,0,0,0,0,0,0,0,0,0,0,0,0,0,0,0,90,0]
["Продукт3",0,0,0,0,0,0,0,0,0,0,0,0,0,0,0,0,0,0,0,0,0,0,0,0]
["Продукт4",0,0,0,0,90,0,0,0,0,0,0,0,0,0,0,0,0,270,0,0,0,0,180,0]
["Продукт5",0,0,0,0,0,0,0,0,0,0,0,0,0,0,0,0,0,0,0,0,0,0,0,0]
["Продукт6",0,0,0,0,20,0,0,0,0,0,0,0,0,0,0,0,0,0,0,0,0,0,0,0]
["Продукт7",0,0,0,0,0,0,0,0,0,0,0,0,0,0,0,0,0,0,0,0,0,0,10,0]
["Продукт8",0,0,0,0,0,0,0,0,0,0,0,0,0,0,0,0,0,0,0,0,0,0,0,0]
["Продукт9",0,0,0,0,10,0,0,0,0,0,0,0,0,0,0,0,0,0,0,0,0,0,0,0]
["Продукт10",0,0,0,0,0,0,0,0,0,0,0,0,0,0,0,0,0,0,0,0,0,0,0,0]
["Продукт11",0,0,0,0,0,0,0,0,0,0,0,0,0,0,0,0,0,0,0,0,0,0,0,0]
["Продукт12",0,0,0,0,0,0,0,0,0,0,0,0,0,0,0,0,0,0,0,0,0,0,10,0]
["Продукт13",0,0,0,0,0,0,0,0,0,0,0,0,0,0,0,0,0,0,0,0,0,0,0,0]
["Продукт14",0,0,0,0,0,0,0,0,0,0,0,0,0,0,0,0,0,0,0,0,0,0,0,0]
["Продукт15",0,0,0,0,0,0,0,0,0,0,0,0,0,0,0,0,0,0,0,0,0,0,0,0]
["Продукт16",0,0,0,0,0,0,0,0,0,0,0,0,0,0,0,0,0,0,0,0,0,0,0,0]
["Продукт17",0,0,0,0,0,0,0,0,0,0,0,0,0,0,0,0,0,0,0,0,0,0,0,0]
["Продукт18",0,0,0,0,0,0,0,0,0,0,0,0,0,0,0,0,0,0,0,0,0,0,0,0]
["Продукт19",0,0,0,0,0,0,0,0,0,0,0,0,0,0,0,0,0,0,0,0,0,0,0,0]
["Продукт20",0,0,0,0,0,0,0,0,0,0,0,0,0,0,0,0,0,0,0,0,0,0,0,0]
["Продукт21",0,48,240,0,0,0,0,0,480,0,0,0,0,0,0,0,0,0,0,0,0,48,0,0]
["Продукт22",0,48,96,0,0,0,0,0,96,0,48,0,0,144,0,0,0,48,0,0,0,48,0,0]
["Продукт23",0,0,288,0,0,0,0,0,96,0,0,0,0,0,0,0,0,0,0,0,0,0,144,0]
["Продукт24",0,0,0,0,0,48,0,0,0,0,0,0,0,0,0,0,0,0,0,0,0,0,144,0]
["Продукт25",0,0,0,0,0,0,0,0,0,0,0,0,0,0,0,0,0,0,0,0,0,0,0,0]
["Продукт26",0,0,0,0,0,0,0,0,0,0,0,0,0,0,0,0,0,0,0,0,0,0,0,0]
["Продукт27",0,48,0,0,0,0,0,0,0,0,0,0,0,0,0,0,0,48,0,0,0,0,0,0]
["Продукт28",0,0,0,0,0,0,0,0,0,0,0,0,0,0,0,0,0,0,0,0,0,0,0,0]
["Продукт29",0,48,0,0,0,0,0,0,0,0,0,0,0,0,0,0,0,0,0,0,0,0,0,0]
["Продукт30",0,0,0,0,0,0,0,0,0,0,0,0,0,0,0,0,0,0,0,0,0,0,0,0]
["Продукт31",0,0,0,0,0,0,0,0,0,0,0,0,0,0,0,0,0,0,0,0,0,0,0,0]
["Продукт32",0,0,0,0,120,0,0,0,0,0,0,0,0,0,0,0,0,120,0,0,0,0,0,0]
["Продукт33",0,0,0,0,0,0,0,0,0,0,0,0,0,0,0,0,0,0,0,0,0,0,0,0]
["Продукт34",0,0,0,0,0,0,0,320,0,400,0,0,200,0,0,0,0,0,0,280,0,0,0,0]
["Продукт35",0,0,0,0,0,0,0,0,0,0,0,0,0,0,0,0,0,0,0,0,0,0,0,0]
["Продукт36",0,40,0,0,0,0,0,0,0,0,0,0,0,0,0,0,0,0,0,0,0,0,0,0]
["Продукт37",0,0,0,0,0,0,0,0,0,0,0,0,0,0,0,0,0,0,0,0,0,0,0,0]
["Продукт38",0,40,400,0,80,0,0,0,0,0,0,0,0,280,0,0,0,0,0,0,0,160,0,0]
["Продукт39",0,0,200,0,40,0,0,0,0,0,0,0,0,400,0,0,0,0,0,0,0,120,0,0]
["Продукт40",0,0,0,0,40,0,0,0,80,0,0,120,0,0,0,0,0,0,0,0,0,40,0,0]
["Продукт41",0,0,0,0,0,0,0,80,0,0,0,0,240,320,0,0,0,0,0,0,0,200,0,0]
["Продукт42",0,0,0,0,0,0,0,0,0,0,0,0,0,0,0,0,0,0,0,0,0,0,0,0]
["Продукт43",0,0,0,0,0,0,0,0,0,0,0,0,0,0,0,0,0,0,0,0,0,0,0,0]
["Продукт44",280,0,0,0,0,80,0,0,0,200,0,0,280,0,0,0,0,0,0,0,0,0,0,0]
["Продукт45",0,0,0,0,0,0,0,0,0,0,0,0,0,0,0,0,0,0,0,0,0,0,0,0]
["Продукт46",0,0,0,0,200,0,0,0,0,0,0,0,0,0,0,0,0,0,0,0,0,0,0,0]
["Продукт47",280,40,0,0,0,0,0,0,600,0,0,560,0,0,0,0,0,0,0,0,0,0,0,0]
["Продукт48",0,0,0,0,0,0,0,0,0,0,0,0,0,0,0,0,0,0,0,0,0,0,0,0]
["Продукт49",0,40,0,0,0,0,0,0,0,0,0,0,0,0,0,0,0,0,0,0,0,0,0,0]
["Продукт50",0,0,0,0,0,0,0,0,0,0,0,0,0,0,0,0,0,0,0,0,0,0,0,0]
["Продукт51",0,0,0,0,0,0,0,0,0,0,0,0,0,0,0,0,0,0,0,0,0,0,0,0]
["Продукт52",0,0,0,0,0,0,0,0,0,0,0,0,0,0,0,0,0,0,0,0,0,0,0,0]
["Продукт53",0,0,0,0,0,0,0,0,0,0,0,0,0,0,0,0,0,0,0,0,0,0,0,0]
["Продукт54",0,0,0,0,0,0,0,0,0,0,0,0,0,0,0,0,0,0,0,0,0,0,0,0]
["Продукт55",0,0,0,0,0,0,0,0,0,0,0,0,0,0,0,0,0,0,0,0,0,0,0,0]
["Продукт56",0,0,0,0,0,0,0,0,0,0,0,0,0,0,0,0,0,0,0,0,0,0,0,0]
["Продукт57",0,0,0,0,0,0,0,0,0,0,0,0,0,0,0,0,0,0,0,0,0,0,0,0]
["Продукт58",0,0,0,0,0,0,0,0,0,0,0,0,0,0,0,0,0,0,0,0,0,0,0,0]
{"$rows_left_out":241}
{"sheet":"data","index":4,"n_rows":4,"n_cols":2,"rows_kept":4,"cut":false,"hidden":true,"merged":[]}
["Склад план доставки","=================================="]
["Склад 1",0]
["Склад 2",1]
["Склад 3"]